1. Are you ready for the Galaxy S20? Here is everything we know so far!

Building Rom Error

Discussion in 'Android Devices' started by Johnny Quach, Jul 1, 2019.

  1. Johnny Quach

    Johnny Quach Lurker
    Thread Starter

    make: Leaving directory '/home/johnnytuan/android/lineage/kernel/zte/draconis'
    make: Entering directory '/home/johnnytuan/android/lineage/kernel/zte/draconis'
    scripts/kconfig/conf --savedefconfig=defconfig Kconfig
    make: Leaving directory '/home/johnnytuan/android/lineage/kernel/zte/draconis'
    [ 0% 11/70046] Building Kernel
    FAILED: TARGET_KERNEL_BINARIES
    /bin/bash -c "(make -j2 -C kernel/zte/draconis O=/home/johnnytuan/android/lineage/out/target/product/draconis/obj/KERNEL_OBJ ARCH=arm CROSS_COMPILE=\" /prebuilts/gcc/linux-x86/arm/arm-eabi-4.8/bin/arm-eabi-\" zImage-dtb ) && (if grep -q '^CONFIG_OF=y' /home/johnnytuan/android/lineage/out/target/product/draconis/obj/KERNEL_OBJ/.config; then echo \"Building DTBs\"; make -j2 -C kernel/zte/draconis O=/home/johnnytuan/android/lineage/out/target/product/draconis/obj/KERNEL_OBJ ARCH=arm CROSS_COMPILE=\" /prebuilts/gcc/linux-x86/arm/arm-eabi-4.8/bin/arm-eabi-\" dtbs; fi ) && (if grep -q '=m' /home/johnnytuan/android/lineage/out/target/product/draconis/obj/KERNEL_OBJ/.config; then echo \"Building Kernel Modules\"; make -j2 -C kernel/zte/draconis O=/home/johnnytuan/android/lineage/out/target/product/draconis/obj/KERNEL_OBJ ARCH=arm CROSS_COMPILE=\" /prebuilts/gcc/linux-x86/arm/arm-eabi-4.8/bin/arm-eabi-\" modules; fi )"
    make: Entering directory '/home/johnnytuan/android/lineage/kernel/zte/draconis'
    scripts/kconfig/conf --silentoldconfig Kconfig
    CHK include/linux/version.h
    CHK include/generated/utsrelease.h
    Using /home/johnnytuan/android/lineage/kernel/zte/draconis as source for kernel
    CC scripts/mod/empty.o
    HOSTCC scripts/conmakehash
    /prebuilts/gcc/linux-x86/arm/arm-eabi-4.8/bin/arm-eabi-gcc: No such file or directory
    Is your PATH set correctly?
    /home/johnnytuan/android/lineage/kernel/zte/draconis/scripts/Makefile.build:307: recipe for target 'scripts/mod/empty.o' failed
    make[3]: *** [scripts/mod/empty.o] Error 2
    /home/johnnytuan/android/lineage/kernel/zte/draconis/scripts/Makefile.build:443: recipe for target 'scripts/mod' failed
    make[2]: *** [scripts/mod] Error 2
    make[2]: *** Waiting for unfinished jobs....
    /home/johnnytuan/android/lineage/kernel/zte/draconis/Makefile:510: recipe for target 'scripts' failed
    make[1]: *** [scripts] Error 2
    Makefile:130: recipe for target 'sub-make' failed
    make: *** [sub-make] Error 2
    make: Leaving directory '/home/johnnytuan/android/lineage/kernel/zte/draconis'
    [ 0% 16/70046] target thumb C++: libv8src <= external/v8/src/profiler/heap-profiler.cc
    ninja: build stopped: subcommand failed.
    12:55:59 ninja failed with: exit status 1


    Can anyone help me out thanks :)
     


    #1 Johnny Quach, Jul 1, 2019
    Last edited: Jul 2, 2019

Zte Zmax Z970 Forum

Features and specs are not yet known.

unknown
Release Date
0
Reviews
Loading...
Similar Threads - Building Rom Error
  1. Watsonhank
    Replies:
    0
    Views:
    461
  2. Samsung
    Replies:
    0
    Views:
    184
  3. ajaymehta32
    Replies:
    1
    Views:
    268
  4. skfl
    Replies:
    0
    Views:
    472
  5. Stokestack
    Replies:
    3
    Views:
    1,095
  6. caatalyst
    Replies:
    16
    Views:
    1,566
  7. stanlive2020
    Replies:
    2
    Views:
    1,241
  8. Eric Harper
    Replies:
    0
    Views:
    735
  9. aio developers
    Replies:
    0
    Views:
    329

Share This Page

Loading...